{"text_format":"1","workbook":"xlsx","n_sheets":2,"sheets":["BilanPh","BD"],"not_rendered":{"charts":0,"images":15,"macros":1,"external_links":0,"defined_names":41,"comments":0,"pivot_tables":0},"unopened":[],"bounds":{"document_bytes":16777216,"sheet_cells":100000,"rows_first":2000,"rows_last":500,"rows_between":2000,"halvings":0,"cell_chars":16384,"cell_head_chars":4096},"cells_cut":0,"cells_raw":0,"read":"whole","date_system":"1900"}

{"sheet":"BilanPh","index":0,"n_rows":260,"n_cols":33,"rows_kept":260,"cut":false,"hidden":false,"merged":[[116,0,116,32],[97,0,97,32],[98,0,98,7],[98,16,98,21],[108,0,108,32],[111,9,111,32],[114,17,114,32],[112,0,112,32],[102,0,102,1],[102,2,102,32],[109,2,109,15],[109,0,109,1],[104,4,104,31],[104,0,104,3],[109,16,109,18],[72,0,72,32],[73,0,73,32],[83,0,83,13],[84,0,84,32],[86,19,86,32],[86,16,86,18],[86,0,86,1],[86,2,86,15],[94,0,94,13],[94,14,94,32],[89,0,89,32],[92,0,92,19],[87,0,87,16],[88,0,88,19],[81,0,81,19],[81,20,81,32],[82,0,82,1],[85,0,85,32],[80,0,80,16],[80,17,80,32],[75,0,75,1],[79,0,79,6],[79,7,79,32],[256,16,256,20],[256,21,256,26],[256,27,256,29],[256,30,256,32],[254,0,254,2],[254,3,254,5],[254,6,254,7],[254,8,254,18],[254,19,254,23],[254,24,254,31],[256,0,256,3],[256,4,256,9],[256,10,256,12],[256,13,256,15],[255,28,255,32],[255,9,255,11],[255,12,255,23],[255,0,255,4],[255,5,255,8],[255,24,255,27],[64,25,65,27],[64,0,65,24],[64,28,65,32],[200,11,200,32],[194,0,194,10],[194,11,194,32],[196,13,196,16],[196,17,196,22],[196,23,196,25],[115,2,115,32],[117,23,117,24],[117,2,117,11],[118,0,118,32],[82,2,82,32],[196,26,196,32],[195,0,195,2],[195,3,195,5],[195,6,195,7],[98,8,98,15],[93,0,93,1],[93,2,93,32],[69,0,69,32],[87,17,87,32],[88,20,88,32],[30,0,30,32],[29,15,29,22],[46,2,46,32],[46,0,46,1],[53,2,53,15],[47,0,47,6],[31,19,31,23],[32,10,32,12],[29,23,29,24],[32,0,32,4],[32,5,32,9],[34,0,34,32],[35,0,35,32],[33,30,33,32],[33,4,33,9],[33,10,33,12],[33,13,33,15],[33,21,33,26],[39,10,39,16],[39,17,39,21],[31,3,31,5],[31,6,31,7],[31,8,31,18],[41,8,41,32],[27,2,27,32],[28,0,28,32],[29,0,29,1],[29,2,29,11],[29,12,29,14],[29,25,29,32],[26,0,26,16],[26,17,26,32],[27,0,27,1],[25,0,25,19],[25,20,25,32],[23,0,23,6],[23,7,23,32],[24,0,24,10],[24,11,24,32],[18,0,18,10],[18,11,18,32],[21,9,21,32],[22,0,22,32],[19,0,19,19],[19,20,19,32],[20,0,20,16],[20,17,20,32],[21,0,21,8],[17,0,17,1],[17,16,17,18],[17,19,17,32],[17,2,17,15],[14,0,14,32],[15,0,15,32],[16,0,16,32],[11,0,12,32],[13,0,13,32],[0,0,7,32],[9,0,9,32],[10,17,10,18],[10,19,10,32],[8,10,8,21],[8,0,8,9],[8,22,8,32],[10,13,10,16],[10,0,10,12],[49,0,49,32],[42,0,42,4],[42,17,42,21],[42,22,42,32],[53,0,53,1],[53,16,53,18],[53,19,53,32],[59,0,59,1],[59,2,59,32],[54,0,54,16],[54,17,54,32],[58,0,58,16],[55,0,55,8],[58,17,58,32],[50,0,50,32],[51,0,51,32],[47,7,47,32],[55,9,55,32],[56,0,56,32],[57,0,57,6],[57,7,57,32],[48,0,48,3],[48,4,48,31],[52,0,52,32],[61,2,61,11],[61,23,61,24],[61,25,61,32],[78,0,78,32],[75,2,75,15],[74,0,74,32],[76,0,76,16],[76,17,76,32],[77,0,77,19],[77,20,77,32],[61,12,61,14],[61,15,61,22],[63,0,63,32],[62,11,62,32],[62,0,62,10],[75,16,75,18],[75,19,75,32],[66,0,66,23],[66,25,66,27],[66,28,66,31],[71,0,71,32],[67,0,67,32],[68,0,68,32],[70,0,70,32],[133,5,133,12],[133,0,133,4],[138,19,138,23],[134,23,134,27],[133,17,133,22],[138,3,138,5],[130,17,130,32],[130,0,130,16],[131,0,131,10],[142,23,142,27],[142,28,142,32],[142,0,142,22],[136,17,136,32],[134,28,134,32],[137,0,137,10],[140,0,140,22],[140,23,140,27],[140,28,140,32],[139,0,139,4],[139,5,139,12],[139,13,139,16],[139,17,139,22],[139,23,139,25],[139,26,139,32],[134,0,134,22],[154,0,154,32],[143,0,143,32],[144,0,144,32],[145,23,145,27],[145,28,145,32],[145,0,145,22],[146,0,146,32],[147,0,147,32],[148,0,148,22],[148,23,148,27],[148,28,148,32],[149,0,149,32],[150,0,150,32],[151,23,151,27],[151,28,151,32],[151,20,151,22],[151,0,151,19],[153,0,153,32],[152,0,152,32],[157,0,157,32],[158,0,158,8],[158,28,158,32],[158,23,158,27],[158,9,158,22],[156,0,156,32],[155,0,155,32],[164,0,164,8],[164,9,164,32],[160,9,160,22],[160,28,160,32],[159,0,159,32],[161,0,161,32],[168,0,168,3],[165,0,165,32],[167,0,167,6],[167,7,167,32],[166,0,166,1],[166,2,166,32],[168,4,168,31],[162,0,162,32],[163,23,163,27],[163,28,163,32],[163,8,163,12],[163,13,163,14],[163,15,163,21],[202,17,202,22],[202,23,202,25],[202,26,202,32],[201,8,201,18],[200,0,200,10],[197,0,197,22],[197,23,197,27],[176,23,176,27],[169,0,169,32],[170,23,170,27],[170,28,170,32],[170,0,170,7],[170,8,170,12],[170,13,170,14],[170,15,170,21],[171,0,171,8],[171,9,171,32],[179,0,179,22],[179,23,179,27],[179,28,179,32],[180,0,180,32],[201,0,201,2],[175,0,175,3],[173,0,173,1],[245,0,245,32],[246,0,246,32],[247,0,247,32],[243,0,243,17],[243,18,243,32],[231,0,231,32],[232,0,232,32],[221,23,221,32],[217,28,217,32],[217,0,217,15],[217,16,217,22],[217,23,217,27],[220,0,220,22],[220,23,220,27],[223,19,223,22],[228,0,228,32],[248,0,248,2],[248,3,248,32],[253,0,253,32],[233,0,233,32],[234,0,234,32],[235,0,235,32],[236,0,236,32],[238,0,238,32],[239,0,239,32],[244,0,244,9],[244,10,244,32],[240,0,240,32],[241,0,241,32],[242,0,242,17],[242,18,242,32],[237,0,237,32],[252,18,252,32],[252,0,252,17],[249,22,249,32],[250,22,250,32],[249,0,249,10],[250,0,250,11],[249,11,249,21],[250,12,250,21],[251,0,251,17],[251,18,251,32],[229,0,229,32],[230,0,230,32],[225,0,225,32],[41,6,41,7],[33,27,33,29],[38,0,38,32],[39,0,39,9],[195,19,195,23],[195,24,195,31],[195,8,195,18],[90,0,90,6],[90,7,90,32],[91,0,91,16],[91,17,91,32],[138,0,138,2],[163,0,163,7],[138,24,138,31],[92,20,92,32],[160,0,160,8],[160,23,160,27],[224,0,224,32],[223,28,223,32],[212,23,212,27],[212,28,212,32],[212,0,212,22],[222,23,222,27],[222,28,222,32],[218,0,218,32],[219,0,219,32],[223,23,223,27],[215,0,215,22],[215,23,215,27],[215,28,215,32],[221,0,221,18],[222,0,222,18],[222,19,222,22],[213,0,213,32],[214,0,214,32],[220,28,220,32],[221,19,221,22],[216,0,216,32],[210,0,210,32],[60,0,60,32],[61,0,61,1],[83,14,83,32],[227,0,227,32],[226,0,226,32],[223,0,223,18],[205,23,205,27],[205,28,205,32],[205,0,205,22],[206,0,206,32],[207,0,207,32],[208,23,208,27],[208,28,208,32],[209,0,209,32],[187,25,187,32],[188,0,188,24],[188,25,188,32],[189,0,189,24],[189,25,189,32],[201,19,201,23],[201,24,201,31],[211,0,211,32],[208,0,208,22],[126,22,126,32],[127,22,127,32],[127,0,127,21],[124,0,124,21],[122,22,122,32],[124,22,124,32],[121,22,121,32],[117,0,117,1],[31,24,31,31],[39,22,39,31],[42,5,42,15],[45,0,45,32],[43,0,43,32],[44,9,44,32],[40,0,40,32],[44,0,44,8],[36,0,36,32],[37,0,37,32],[32,13,32,32],[33,16,33,20],[33,0,33,3],[31,0,31,2],[41,0,41,2],[41,3,41,5],[173,2,173,32],[174,0,174,6],[174,7,174,32],[172,0,172,32],[178,0,178,32],[175,4,175,31],[177,0,177,32],[176,28,176,32],[176,0,176,22],[181,0,181,24],[182,0,182,24],[183,0,183,24],[184,0,184,24],[181,25,181,32],[182,25,182,30],[183,25,183,30],[184,25,184,30],[184,31,184,32],[183,31,183,32],[182,31,182,32],[203,28,203,32],[190,0,190,24],[190,25,190,32],[191,0,191,32],[192,0,192,32],[193,0,193,18],[193,19,193,32],[185,0,185,32],[186,0,186,24],[186,25,186,32],[187,0,187,24],[203,23,203,27],[203,0,203,22],[197,28,197,32],[196,5,196,12],[201,3,201,5],[201,6,201,7],[202,0,202,4],[202,5,202,12],[202,13,202,16],[198,0,198,32],[199,0,199,18],[199,19,199,32],[196,0,196,4],[138,6,138,7],[138,8,138,18],[136,0,136,16],[119,0,119,32],[137,11,137,32],[133,26,133,32],[133,13,133,16],[135,0,135,32],[132,24,132,31],[132,0,132,2],[132,6,132,7],[132,8,132,18],[132,3,132,5],[132,19,132,23],[133,23,133,25],[131,11,131,32],[125,22,125,32],[128,0,128,32],[129,0,129,32],[120,0,120,32],[121,0,121,21],[123,0,123,21],[123,22,123,32],[126,0,126,21],[95,0,95,32],[117,25,117,32],[110,17,110,32],[113,0,113,6],[113,7,113,32],[110,0,110,16],[114,0,114,16],[115,0,115,1],[125,0,125,21],[103,7,103,32],[109,19,109,32],[99,0,99,32],[100,0,100,8],[100,9,100,32],[101,0,101,32],[117,15,117,22],[98,22,98,31],[96,0,96,32],[117,12,117,14],[103,0,103,6],[105,0,105,32],[106,0,106,32],[107,0,107,32],[111,0,111,8]]}
[]
[]
[]
[]
[]
[]
[]
[]
[null,null,null,null,null,null,null,null,null,null,"BILAN DE PHOSPHORE"]
[]
[null,null,null,null,null,null,null,null,null,null,null,null,null,"ANNÉE 20"]
[]
[]
["1.     DESCRIPTION DE L’EXPLOITATION AGRICOLE"]
["1.1   Identification de l’exploitant "]
["Selon le cas, remplir l’une des deux sections ci-dessous."]
["Particulier (individu)"]
["Nom :",null,null,null,null,null,null,null,null,null,null,null,null,null,null,null,"Prénom :"]
["Numéro de l’intervenant : "]
["Numéro de l’exploitation agricole enregistrée au MAPAQ (NIM) : "]
["Numéro de client de la Financière agricole du Québec:"]
["NEQ (si enregistré au REQ):"]
["Autre"]
["Nom de l’entreprise : "]
["Numéro de l’intervenant : "]
["Numéro de l’exploitation agricole enregistrée au MAPAQ (NIM) : "]
["Numéro de client de la Financière agricole du Québec:"]
["NEQ:"]
["Répondant ou personne à contacter"]
["Nom :",null,null,null,null,null,null,null,null,null,null,null,"Prénom :",null,null,null,null,null,null,null,null,null,null,"Titre :"]
["1.2   Adresse"]
["Numéro :",null,null,null,null,null,"Rue :",null,null,null,null,null,null,null,null,null,null,null,null,"Municipalité :",null,null,null,null,"",null,null,null,null,null,null,null,{"$f":"VLOOKUP(Y32,BD!$P$1:$Q$2000,2,0)","v":{"$error":"#N/A"}}]
["Code postal :",null,null,null,null,null,null,null,null,null,"Courriel :"]
["Téléphone :",null,null,null,null,null,null,null,null,null,"Poste :",null,null,null,null,null,"Autre numéro :",null,null,null,null,null,null,null,null,null,null,"Poste :"]
[]
["LIEU VISÉ PAR LE BILAN"]
[" Remplir la section 1.3 pour les lieux d’élevage ou la section 1.4 pour les lieux d’épandage."]
[]
["1.3   Description du lieu d’élevage (voir la définition dans le Guide du bilan de phosphore)"]
["Numéro de lieu :",null,null,null,null,null,null,null,null,null,null,null,null,null,null,null,null,"Municipalité :",null,null,null,null,"",null,null,null,null,null,null,null,null,null,{"$f":"VLOOKUP(W40,BD!$G$1:$H$2000,2,0)","v":{"$error":"#N/A"}}]
["1.3.1  Adresse du lieu (si elle est différente de l’adresse à la section 1.2)"]
["Numéro :",null,null,null,null,null,"Rue :"]
["Municipalité :",null,null,null,null,"",null,null,null,null,null,null,null,null,null,null,{"$f":"VLOOKUP(F43,BD!$G$1:$H$2000,2,0)","v":{"$error":"#N/A"}},"Code postal :"]
["1.3.2  Localisation cadastrale du lieu"]
["Cadastre rénové du Québec : "]
["Si non rénové :"]
["Lot : "]
["Rang ou concession :"]
["Cadastre :",null,null,null,"",null,null,null,null,null,null,null,null,null,null,null,null,null,null,null,null,null,null,null,null,null,null,null,null,null,null,null,{"$f":"VLOOKUP(E49,BD!$M$1:$N$2000,2,0)","v":{"$error":"#N/A"}}]
["1.3.3  Propriétaire du lieu"]
["Si l’exploitant est propriétaire du lieu, passer à la section 1.3.4."]
["Sinon, selon le cas, remplir l’une des deux sections ci-dessous."]
["Particulier (individu)"]
["Nom :",null,null,null,null,null,null,null,null,null,null,null,null,null,null,null,"Prénom :"]
["Numéro de l'intervenant du propriétaire du lieu :"]
["NEQ (si enregistré au REQ) : "]
["Autre"]
["Nom de l’entreprise : "]
["Numéro de l'intervenant du propriétaire du lieu :"]
["NEQ :"]
{"$rows_left_out":201}
{"sheet":"BD","index":1,"n_rows":1482,"n_cols":17,"rows_kept":1482,"cut":false,"hidden":true,"merged":[]}
["Agneau léger - mâle ou femelle (poids vif final ≤ 30 kg)",51,null,"Liquide",1,null,"Abercorn VL (46005)","46005",null,"Abitibi","880",null,"Aberdeen (070500)","070500",null,"Abercorn VL (46005)","46005"]
["Agneau lourd - mâle ou femelle (poids vif final ≤ 47 kg)",52,null,"Solide",2,null,"Acton Vale V  (48028)","48028",null,"Abitibi-Ouest","870",null,"Aberford (070520)","070520",null,"Acton Vale V  (48028)","48028"]
["Agnelle de remplacement (poids vif final ≤ 55 kg)",35,null,"Sans objet",3,null,"Adstock M  (31056)","31056",null,"Acton","480",null,"Acton Vale (041030)","041030",null,"Adstock M  (31056)","31056"]
["Aucun animal",82,null,null,null,null,"Aguanish M  (98030)","98030",null,"Administration régionale Kativik","992",null,"Adams (063540)","063540",null,"Aguanish M  (98030)","98030"]
["Autre animal - poids vif de l'animal à la fin de la période d'élevage < 1 kg",115,null,null,null,null,"Akulivik TI (99883)","99883",null,"Antoine-Labelle","790",null,"Addington (060520)","060520",null,"Akulivik TI (99883)","99883"]
["Autre animal - poids vif de l'animal à la fin de la période d'élevage ≥ 1 et < 5 kg",116,null,null,null,null,"Akulivik VN (99125)","99125",null,"Argenteuil","760",null,"Adstock (040230)","040230",null,"Akulivik VN (99125)","99125"]
["Autre animal - poids vif de l'animal à la fin de la période d'élevage ≥ 10 et < 20 kg",118,null,null,null,null,"Akwesasne R  (69802)","69802",null,"Arthabaska","390",null,"Agnès (040080)","040080",null,"Akwesasne R  (69802)","69802"]
["Autre animal - poids vif de l'animal à la fin de la période d'élevage ≥ 100 et < 500 kg",120,null,null,null,null,"Albanel M  (92030)","92030",null,"Avignon","060",null,"Aigremont (081430)","081430",null,"Albanel M  (92030)","92030"]
["Autre animal - poids vif de l'animal à la fin de la période d'élevage ≥ 20 et < 100 kg",119,null,null,null,null,"Albertville M  (07025)","07025",null,"Beauce-Sartigan","290",null,"Aiguebelle (071910)","071910",null,"Albertville M  (07025)","07025"]
["Autre animal - poids vif de l'animal à la fin de la période d'élevage ≥ 5 et < 10 kg",117,null,null,null,null,"Alleyn-et-Cawood M  (84050)","84050",null,"Beauharnois-Salaberry","700",null,"Ailleboust (081380)","081380",null,"Alleyn-et-Cawood M  (84050)","84050"]
["Autre animal - poids vif de l'animal à la fin de la période d'élevage ≥ 500 kg",121,null,null,null,null,"Alma V  (93042)","93042",null,"Bécancour","380",null,"Albanel (081200)","081200",null,"Alma V  (93042)","93042"]
["Autruche - mâle ou femelle",75,null,null,null,null,"Amherst CT (78070)","78070",null,"Bellechasse","190",null,"Albert (101180)","101180",null,"Amherst CT (78070)","78070"]
["Autruche d’engraissement - mâle ou femelle",76,null,null,null,null,"Amos V  (88055)","88055",null,"Bonaventure","050",null,"Aldfield (070200)","070200",null,"Amos V  (88055)","88055"]
["Bélier adulte",49,null,null,null,null,"Amqui V  (07047)","07047",null,"Brome-Missisquoi","460",null,"Alleyn (070420)","070420",null,"Amqui V  (07047)","07047"]
["Bison adulte - mâle ou femelle",44,null,null,null,null,"Ange-Gardien M  (55008)","55008",null,"Caniapiscau","972",null,"Amherst (051610)","051610",null,"Ange-Gardien M  (55008)","55008"]
["Bouc adulte",77,null,null,null,null,"Armagh M  (19037)","19037",null,"Charlevoix","160",null,"Amherst (060510)","060510",null,"Armagh M  (19037)","19037"]
["Bovin à l’engraissement (bovin semi-finition et finition)",94,null,null,null,null,"Arundel CT (78060)","78060",null,"Charlevoix-Est","150",null,"Amos (071980)","071980",null,"Arundel CT (78060)","78060"]
["Bovin de finition (> 400 kg)",25,null,null,null,null,"Asbestos V  (40043)","40043",null,"Coaticook","440",null,"Angers (021730)","021730",null,"Asbestos V  (40043)","40043"]
["Bovin de semi-finition (de 268 à 400 kg)",47,null,null,null,null,"Ascot Corner M  (41055)","41055",null,"D'Autray","520",null,"Angoulême (062560)","062560",null,"Ascot Corner M  (41055)","41055"]
["Brebis et ses agneaux de lait",34,null,null,null,null,"Aston-Jonction M  (50013)","50013",null,"Deux-Montagnes","720",null,"Anticosti (100630)","100630",null,"Aston-Jonction M  (50013)","50013"]
["Caille (chair) - mâle ou femelle",32,null,null,null,null,"Auclair M  (13045)","13045",null,"Drummond","490",null,"Antoine (081310)","081310",null,"Auclair M  (13045)","13045"]
["Canard - mâle ou femelle",33,null,null,null,null,"Audet M  (30055)","30055",null,"Eeyou Istchee","993",null,"Arago (030640)","030640",null,"Audet M  (30055)","30055"]
["Canard de Pékin - mâle ou femelle",93,null,null,null,null,"Aumond CT (83090)","83090",null,"Jamésie (terr. conventionné)","991",null,"Archambault (051470)","051470",null,"Aumond CT (83090)","83090"]
["Cerf de Virginie - mâle ou femelle",56,null,null,null,null,"Aupaluk TI (99891)","99891",null,"Joliette","610",null,"Archipel-de-Blanc-Sablon (100120)","100120",null,"Aupaluk TI (99891)","99891"]
["Cerf rouge - mâle ou femelle",55,null,null,null,null,"Aupaluk VN (99105)","99105",null,"Kamouraska","140",null,"Archipel-de-Kécarpoui (100100)","100100",null,"Aupaluk VN (99105)","99105"]
["Chèvre angora (≥ 1 an)",37,null,null,null,null,"Austin M  (45085)","45085",null,"La Côte-de-Beaupré","210",null,"Archipel-de-Ouapitagone (100020)","100020",null,"Austin M  (45085)","45085"]
["Chèvre de boucherie",53,null,null,null,null,"Authier M  (87050)","87050",null,"La Côte-de-Gaspé","030",null,"Archipel-de-Saint-Augustin (100110)","100110",null,"Authier M  (87050)","87050"]
["Chèvre laitière (≥ 1 an)",36,null,null,null,null,"Authier-Nord M  (87100)","87100",null,"La Haute-Côte-Nord","950",null,"Archipel-de-Sainte-Marie (100040)","100040",null,"Authier-Nord M  (87100)","87100"]
["Chevrette ou chevreau (de 3 jours à 364 jours)",113,null,null,null,null,"Ayer's Cliff VL (45035)","45035",null,"La Haute-Gaspésie","040",null,"Archipel-de-Washicoutai (100010)","100010",null,"Ayer's Cliff VL (45035)","45035"]
["Chinchilla femelle et sa progéniture non sevrée",41,null,null,null,null,"Baie-Atibenne NO (62920)","62920",null,"La Haute-Yamaska","470",null,"Archipel-du-Gros-Mécatina (100080)","100080",null,"Baie-Atibenne NO (62920)","62920"]
["Cochette",19,null,null,null,null,"Baie-Comeau V  (96020)","96020",null,"La Jacques-Cartier","220",null,"Archipel-du-Petit-Mécatina (100060)","100060",null,"Baie-Comeau V  (96020)","96020"]
["Coq - œufs d'incubation",101,null,null,null,null,"Baie-de-la-Bouteille NO (62906)","62906",null,"La Matanie","080",null,"Archipel-du-Vieux-Fort (100190)","100190",null,"Baie-de-la-Bouteille NO (62906)","62906"]
["Daim - mâle ou femelle",78,null,null,null,null,"Baie-des-Chaloupes NO (79920)","79920",null,"La Matapédia","070",null,"Argenson (081350)","081350",null,"Baie-des-Chaloupes NO (79920)","79920"]
["Dindon à griller - mâle ou femelle (≤ 9,9 kg)",28,null,null,null,null,"Baie-des-Sables M  (08080)","08080",null,"La Mitis","090",null,"Armagh (030850)","030850",null,"Baie-des-Sables M  (08080)","08080"]
["Dindon lourd - mâle ou femelle (> 9,9 kg)",21,null,null,null,null,"Baie-d'Hudson NO (99904)","99904",null,"La Nouvelle-Beauce","260",null,"Armand (030070)","030070",null,"Baie-d'Hudson NO (99904)","99904"]
["Émeu - mâle ou femelle",60,null,null,null,null,"Baie-du-Febvre M  (50100)","50100",null,"La Rivière-du-Nord","750",null,"Arnaud (100800)","100800",null,"Baie-du-Febvre M  (50100)","50100"]
["Émeu d’engraissement - mâle ou femelle",74,null,null,null,null,"Baie-D'Urfé V  (66112)","66112",null,"La Tuque","900",null,"Arthabaskaville (041930)","041930",null,"Baie-D'Urfé V  (66112)","66112"]
["Étalon",38,null,null,null,null,"Baie-Johan-Beetz M  (98035)","98035",null,"La Vallée-de-la-Gatineau","830",null,"Artois (070330)","070330",null,"Baie-Johan-Beetz M  (98035)","98035"]
["Faisan - mâle ou femelle",30,null,null,null,null,"Baie-Obaoca NO (62918)","62918",null,"La Vallée-de-l'Or","890",null,"Arundel (060220)","060220",null,"Baie-Obaoca NO (62918)","62918"]
["Génisse de boucherie (de 8 mois à 15 mois)",10,null,null,null,null,"Baie-Sainte-Catherine M  (15065)","15065",null,"La Vallée-du-Richelieu","570",null,"Arvida (080260)","080260",null,"Baie-Sainte-Catherine M  (15065)","15065"]
["Génisse laitière d’une race autre que Canadienne ou Jersey (de 12 jours à 15 mois)",83,null,null,null,null,"Baie-Saint-Paul V  (16013)","16013",null,"Lac-Saint-Jean-Est","930",null,"Asbestos (041430)","041430",null,"Baie-Saint-Paul V  (16013)","16013"]
["Génisse laitière de race Canadienne (de 12 jours à 15 mois)",112,null,null,null,null,"Baie-Trinité VL (96005)","96005",null,"L'Assomption","600",null,"Ascot (041300)","041300",null,"Baie-Trinité VL (96005)","96005"]
["Génisse laitière de race Jersey (de 12 jours à 15 mois)",109,null,null,null,null,"Barkmere V  (78050)","78050",null,"Le Domaine-du-Roy","910",null,"Ashburton (030860)","030860",null,"Barkmere V  (78050)","78050"]
["Hongre",40,null,null,null,null,"Barnston-Ouest M  (44045)","44045",null,"Le Fjord-du-Saguenay","942",null,"Ashford (030750)","030750",null,"Barnston-Ouest M  (44045)","44045"]
["Jument et sa progéniture non sevrée",39,null,null,null,null,"Barraute M  (88022)","88022",null,"Le Golfe-du-Saint-Laurent","982",null,"Ashuapmouchouan (080940)","080940",null,"Barraute M  (88022)","88022"]
["Lama - mâle ou femelle",79,null,null,null,null,"Batiscan M  (37210)","37210",null,"Le Granit","300",null,"Asselin (021710)","021710",null,"Batiscan M  (37210)","37210"]
["Lapine et sa progéniture jusqu’à l’abattage",45,null,null,null,null,"Beaconsfield V  (66107)","66107",null,"Le Haut-Richelieu","560",null,"Assemetquagan (021010)","021010",null,"Beaconsfield V  (66107)","66107"]
["Nandou - mâle ou femelle",86,null,null,null,null,"Béarn M  (85020)","85020",null,"Le Haut-Saint-François","410",null,"Atwater (072950)","072950",null,"Béarn M  (85020)","85020"]
["Oie - mâle ou femelle",58,null,null,null,null,"Beauceville V  (27028)","27028",null,"Le Haut-Saint-Laurent","690",null,"Auckland (040260)","040260",null,"Beauceville V  (27028)","27028"]
["Paon - mâle ou femelle",87,null,null,null,null,"Beauharnois V  (70022)","70022",null,"Le Rocher-Percé","020",null,"Auclair (030140)","030140",null,"Beauharnois V  (70022)","70022"]
["Pintade - mâle ou femelle",31,null,null,null,null,"Beaulac-Garthby M  (31008)","31008",null,"Le Val-Saint-François","420",null,"Aulneau (080520)","080520",null,"Beaulac-Garthby M  (31008)","31008"]
["Porc à l'engraissement - mâle ou femelle (> 25 kg jusqu’à l’abattage)",3,null,null,null,null,"Beaumont M  (19105)","19105",null,"L'Érable","320",null,"Aumond (060920)","060920",null,"Beaumont M  (19105)","19105"]
["Porcelet sevré (≤ 25 kg)",1,null,null,null,null,"Beaupré V  (21025)","21025",null,"Les Appalaches","310",null,"Awantjish (021260)","021260",null,"Beaupré V  (21025)","21025"]
["Poulain ou pouliche",48,null,null,null,null,"Bécancour V  (38010)","38010",null,"Les Basques","110",null,"Awantjish (021280)","021280",null,"Bécancour V  (38010)","38010"]
["Poule pondeuse - œufs de consommation",5,null,null,null,null,"Bedford CT (46040)","46040",null,"Les Chenaux","372",null,"Aylmer (040140)","040140",null,"Bedford CT (46040)","46040"]
["Poule pondeuse - œufs d'incubation",105,null,null,null,null,"Bedford V  (46035)","46035",null,"Les Collines-de-l'Outaouais","820",null,"Aylmer (060620)","060620",null,"Bedford V  (46035)","46035"]
["Poulet à griller - femelle (≤ 3,0 kg)",103,null,null,null,null,"Bégin M  (94250)","94250",null,"Les Etchemins","280",null,"Aylwin (060720)","060720",null,"Bégin M  (94250)","94250"]
["Poulet à griller - mâle (≤ 3,0 kg)",102,null,null,null,null,"Belcourt M  (89050)","89050",null,"Les Jardins-de-Napierville","680",null,"Babel (100860)","100860",null,"Belcourt M  (89050)","89050"]
["Poulet à rôtir - mâle ou femelle (> 3,0 kg)",27,null,null,null,null,"Belle-Rivière NO (93908)","93908",null,"Les Laurentides","780",null,"Baby (070900)","070900",null,"Belle-Rivière NO (93908)","93908"]
["Poulette - œufs de consommation",22,null,null,null,null,"Belleterre V  (85065)","85065",null,"Les Maskoutains","540",null,"Bagot (080180)","080180",null,"Belleterre V  (85065)","85065"]
{"$rows_left_out":1422}